Unexpected Top-level Error Java.lang.assertionerror

How to solve start up error on Android Studio  java.lang.NullPointerException internal error

RECOMMENDED: If you have Windows errors then we strongly recommend that you download and run this (Windows) Repair Tool.

Runtime Error 11 Division By Zero Cyber Admin Control Simple Methods to Your Runtime Error 11 Division By Cero Cyber Admin Control 3.2. Runtime Error 11 Division By Cero

Android – I ran the android studio quickstep instructions but it runs with the following error: Error:Execution failed for task. 1.11.0-1e98a6aa8e32cd8507f22865ef9b2a757429d9bf.jar Error Code: 2 Output: UNEXPECTED TOP-LEVEL.

java.lang.AssertionError Unexpected method call findFoos([email protected], 10, (ObjectMethodsFilter.java:45) at $Proxy0.findFoos.

Standard Measure Of Error Formula and STDEV.S to calculate standard deviation of a sample. Putting all this together, you get the standard error of the

java.lang.Error. Constructs an AssertionError with its detail message derived from the specified char, which is converted to a string as defined in section 15.18.1.1 of The Java™ Language Specification.

Runtime Error 3420 Object No Longer Valid Does anyone know a probably cause of RunTime error 3420 "Object invalid or no longer set"? I’m getting this error

Jackson Exceptions – Problems and Solutions | Baeldung – Jul 19, 2017. Can not construct instance of org.baeldung.jackson.exception. at c.f.j.d. JsonMappingException.from(JsonMappingException.java:148). Next – let's discuss JsonParseException: Unexpected character. getValueAsString()Ljava / lang/String ;. This is by no means an exhaustive list – just the top ones.

And yet all parties involved forgot to ask the player himself – and his decision was unexpected. "I don’t want to play for. Sanchez is talented, but has only been.

Concolic Execution in Java PathFinder and its Applications. We augment the constraints tree by recording the outcome “error” along with. mentioned before, JDart is built on top of the Java PathFin-. |-[+]_/OK: [ ]. +-[-]_/ERROR: java.lang. AssertionError. exploration (at the level of objects/classes) of the program state.

A user complained that iCloud stopped working after installing a security update and returned the following error message when he tried to view iCloud folders. The set of folders cannot be opened. An unexpected error has.

When you tried to edit a Wiki Page in SharePoint 2010 you got the error.

Unexpected Top-level Error Java.lang.assertionerror Download. – Common Unexpected Top-level Error Java.lang.assertionerror and their Solutions. Having said that, there's no need to think so much about that, you should remember that Unexpected Top-level Error Java.lang.assertionerror will always be there.

Aug 20, 2017. Assertions are a way of breaking out of code when there is an error or an unexpected input. error and return to top level if not true;. GAP has assertions levels. before 42. before 'Hello Universe'. java.lang. Assertions need to be enabled using java's -ea option for an AssertionError to be thrown.

`UNEXPECTED TOP-LEVEL ERROR: java.lang.OutOfMemoryError: GC overhead limit exceeded:android:transformClassesWithDexForProdRelease FAILED.

java.lang.AssertionError Unexpected result. expected:<1> but was:<5> Samebug tips 1. We couldn’t find tips for this exception. Ask an expert. Don’t give up yet.

Assertion Error when creating a project with Maven. [STUDIO-5255]. java.lang. IllegalStateException: Mule project is null in design context. [STUDIO-5663].

Parse error: syntax error, unexpected '}', expecting identifier (T_STRING) or variable (T_VARIABLE) or '{' or '$' in /home1/lsharm/public_html/index.php on line 110.

RECOMMENDED: Click here to fix Windows errors and improve system performance

About the Author

Alden

View Posts →