Stray C Error

RECOMMENDED: If you have Windows errors then we strongly recommend that you download and run this (Windows) Repair Tool.

programming – "stray '/302' in program error" when compiling. – Oct 27, 2016. 0302 is 0xc2. Somewhere in your source you have one or more non-breaking spaces (0xa0) encoded in UTF-8 (0xc2 0xa0). Use od or a similar.

John McCain claims that his first plane crash, back in December 1960, was the result of engine failure. A U.S. Navy investigation makes clear that it was caused by.

Time Sync Error If synchronization is enabled, your computer clock is synchronized with an Internet time server once a week. However, if you

A stray bullet struck a Marthasville home and landed just feet. He said the best backstop for a target area is an earthen structure that gives you a large margin of error. He does not recommend round hay bales or any substance that could.

stray '\160' in program. C / C++ Forums on Bytes. that's a *very* peculiar error message. If a compiler found a stray character 160-decimal in a source file,

hi I'm trying to write a program for a simple game but getting errors stray '\342' and '\200' and '\214' using g++ and gedit in ubuntu 13.10. the code is

Jun 07, 2017  · Deputies investigate the shooting of a young boy in East Compton on June 7, 2017. (Credit: KTLA)

We know how good this side is defensively across the park and how they apply.

David Bausum – Question about—error: stray '@' in program – Oct 28, 2009. 28 Oct 2009 09:57:22 -0500; Subject: Question about—error: stray. -o hw hw. c hw.c:3: error: stray '@' in program hw.c:3: error: expected '.

Apr 17, 2008. Lately I have been worried about a strange error message I have been getting from gcc, while trying to compile small C programs for my.

Badger, a six-year-old border collie-corgi mix, is a stray and was found behind the fire lines in Kamloops. Kamloops SPCA

A western Wisconsin farmer could be awarded up to $13.5 million after winning a five-year legal battle against an electric services company over stray volt

Partition Magic 7 Error 27 Big boot problem, error 1516 Partition improperly dimounted if you. – It was only a small (7-8 MB) partition and

For starters, even for an adventurous day trip at Mount Spokane, all three of us.

C. Ball (argued), Hendrickson Law Firm P.C., Billings. 556, 560 (9th Cir. 2015). Due to these stray remarks, McChesney demanded a do-over. To support his motion for a new trial, McChesney submitted an affidavit from his co-defendant’s.

Vmware Data Recovery Trouble Reading Files Error Jul 31, 2014. The free space reported in VMware Data Recovery never increases. VMware Data Recovery 2.0 reports error -1115

I am trying to compile several third-party software from source code (i.e. zchaff, argosat) and get errors such as: Error: ‘strlen’ was not declared in this scope.

Switch to forward slash / instead of double-backslashes. It works on Win, and means you don't have to worry about double-slashes. Which compiler (and preprocessor.

Because you cut and paste from the internet, and in doing so included bad characters.

Stray dogs fitted with special maybe making their way onto the. So, it’s going to be trial and error. We’re also going to be on a steep learning curve at the start.

A frameshift mutation (also called a framing error or a reading frame shift) is a genetic mutation caused by indels (insertions or deletions) of a number of.

c – Compilation error: stray '\302' in program etc – Stack. – I am having problem compiling the followed exploit code: http://downloads.securityfocus.com/vulnerabilities/exploits/59846-1.c I am using: "gcc file.c" and "gcc -O2.

How to fix compilation errors that mention "stray '\342'" and "stray. error: stray '\200' in program first.c:4:1: error: stray '\234' in program.

RECOMMENDED: Click here to fix Windows errors and improve system performance

About the Author

Alden

View Posts →