Error Subprocess Post

How to fix sub-process /usr/libexec/cydia/cydo returned an error code (2) and (100) without restore

RECOMMENDED: If you have Windows errors then we strongly recommend that you download and run this (Windows) Repair Tool.

Understand dpkg and don’t get stuck with a maintainer script failure – rm: cannot remove `/etc/rc1.d/K20acpid’: No such file or directory dpkg: error processing acpid (–configure): subprocess installed post-installation script returned error exit status 1 Errors were encountered while processing:.

[Y/n] y Setting up mfi (2.1.11-4990). ln: failed to create symbolic link ‘/usr/lib/mfi/logs/mfi’: File exists dpkg: error processing package mfi (–configure): subprocess installed post-installation script returned error exit status 1 Setting.

I want to check if a subprocess has finished execution successfully or failed. Currently I have come up with a solution but I am not sure if it is correct and reliable.

Sharepoint 2010 Error Unexpected Error In Silverlight Application Latest trending topics being covered on ZDNet including Reviews, Tech Industry, Security, Hardware, Apple, and Windows Sep 6, 2015. But
Error 404 Fix Microsoft Here, in this post, we are going to a see how we can resolve the 404 ResourceNotFound Error After Uploading

Error in subprocess python. Post as a guest. Name. Email. discard. By posting. subprocess error in python. 0. subprocess open.

[Solved] subprocess installed post-installation script returned. – In Synaptic the last 2 days I get this error message every time: E: mma: subprocess installed post-installation script returned error exit status 1.

dpkg: error processing package linux-image-4.4.0-64-generic (–configure): subprocess installed post-installation script returned. image-generic linux-generic E: Sub-process /usr/bin/dpkg returned an error code (1) desktop:~$ sudo.

how to remove a package which post-installation and. – Server Fault – You might try to upgrade the package before purging it. In some cases, the new package will fix the removal script ( dpkg is made so that new.

dpkg: error processing xyz (–remove): subprocess post-removal script returned error exit status 10 Errors were encountered while processing: xyz E: Sub-process /usr/bin/dpkg returned an error code (1)

For such an affordable device, there’s a lot that the Raspberry Pi can do. One of the simplest and most useful ways to use your.

Error Message: Ubuntu Error "subprocess post-installation script returned error exit status 1 " Summary:This error is caught when the package is.

Error Joining Network Os X If your Roku won’t connect to the internet and shows Error 014, follow these instructions to get it connected to

In short: I am trying to install spamassassin but dpkg returns only with: dpkg: error processing spamassassin (–configure): subprocess installed post-installation.

I wanted to be able to upload photos from my RasPiCamcorder straight to DropBox. So I did a little research and came across an absolute gem of a program called.

Apr 17, 2014. Setting up gconf2 (2.28.1-6). dpkg: error processing gconf2 (–configure): subprocess installed post-installation script returned error exit status.

proc_open (PHP 4 >= 4.3.0, PHP 5, PHP 7) proc_open — Execute a command and open file pointers for input/output

Feb 17, 2014. Ok, I have found the solution for this problem. Thought I was unable to crank up the logging to get more data, the data already presented had.

This tutorial will show you how to install the latest version of Python 2 and Python 3 on CentOS 6. You can also use it to install the latest version of Python 3 on.

The ever useful and neat subprocess module 29 Apr, 2012. Python’s subprocess module is one of my favourite modules in the standard library. If you have ever done some.

Yesterday, I wrote and ran a python script which executes a shell using subprocess.Popen(command.split()) where command is string.

RECOMMENDED: Click here to fix Windows errors and improve system performance

About the Author

Alden

View Posts →