Error C2501 Missing Storage

RECOMMENDED: If you have Windows errors then we strongly recommend that you download and run this (Windows) Repair Tool.

Aug 18, 2014. in error C2501 “missing storage-class or type specifiers” during compilation. This error occurs because earlier versions of Visual C++ and the.

Error2501: missing storage-class or type specifiers. – Error2501: missing storage-class or type specifiers. 0. (126) : error C2501: 'CRPCValidation::m_pRpcControlImpl' : missing storage-class or type specifiers

how to resolve Undeclared Identifier, error C2501: missing storage-class or type specifiers. CMyTabCtrl' : missing storage-class or type specifiers. c:.

Huawei Error 1002 Chair: Osama Aboul-Magd (Huawei Technologies) Vice Chair: Simone Merlin (Qualcomm) Vice Chair: Ron Porat (Broadcom) Secretary: Yasuhiko Inoue. Huawei Mobile

OK, it drives me nuts when I get generic errors like this. I have the following code in my program. Actually, I have written a ton of code for these.

“Because that’s the way it is.” When KPRC called U-Haul, the company was able.

. error C2146: syntax error : missing ';. error C2501: 'DWORD' : missing storage-class or type specifiers.\a. c++ header file errors?.

c:program filesmicrosoft visual studiovc98includeras.h(47) : error C2501: ' DECLARE_HANDLE' : missing storage-class or type specifiers

. error C2501: 'T' : missing storage-class or type specifiers. C:DataET486Final CollegeApplications.cpp(84) : fatal error C1004: unexpected.

opengl – error C2501: 'WINGDIAPI' : missing storage-class or. – I am trying to Mipmap Textures. Microsoft visual studio 6.0 gives the error below. error C2501: 'WINGDIAPI' : missing storage-class or type specifiers WINGDIAPI void.

Among his successful sales that day were four chairs he’d brought out of storage.

I thought I was being helpful, pointing out extra storage and other features, but.

error C2501: 'wxRecServNotebook::TESTING' : missing storage-class or type specifiers wxRecServCalText is the name of the class that.

Mid Cap – If my performance differs, is that "tracking error," or "active management," or just two incommensurable. then that is a security even if one day they may end up using it to buy cloud storage. That raises further questions: When do tokens.

Error Box In C Displays a modal dialog box that contains a system icon, a set of buttons, and a brief application-specific message, such
Games For Windows Live Installer Error Microsoft released new cumulative updates for Windows 10 today. experience with new games. “Addressed issue that affects the download of

Compiler Error C2501. missing storage-class or type specifiers. Spelling or capitalization error. Missing type specifier in the declaration of the identifier.

RECOMMENDED: Click here to fix Windows errors and improve system performance

About the Author

Alden

View Posts →