Error C2065 Undeclared Identifier In C

RECOMMENDED: If you have Windows errors then we strongly recommend that you download and run this (Windows) Repair Tool.

Trophy Error 80022d11 Solved: People seem to be getting this same problem on Burnout and Wipeout. My save data already got corrupted on

Table of Contents. Andreas Marschall’s TAPI and TSPI FAQ. Frappr! Group TAPI around the World. Table of Contents. Frequently Asked Questions (FAQ) General

1>C:ImaginationPowerVR_GraphicsPowerVR_SDKSDK_2017_R1 Framework. error C2065: 'OriginalType' : undeclared identifier

srcPeistalticUDFNEW.C(29) : error C2143: syntax error : missing ';' before 'type'. .srcPeistalticUDFNEW.C(30) : error C2065: 'counter' : undeclared identifier.

Ruby Throw Argument Error These are the "normal" exceptions that typical Ruby. you can pass in the class name as an argument to. Improper

Compiler Error C2065. Visual Studio 2015. The latest version of this topic can be found at Compiler Error C2065. identifier' : undeclared identifier.

It all started with a blank function in C++ giving me this weird error saying there was an unidentified symbol. Error 1 error C2065: 'UniqueValueBlah' : undeclared identifier. Tags:unreal engine 4c++bug report4.9identifier.

. 8ff0-859b7d286b92/error-c2146-for-cstring-and-atlcomclih-error-c2065-guidnull-undeclared-identifier?forum. undeclared identifier 1>c:.

1>c:users********documentsvisual studio 2010projectsthe runthe runmain. cpp(56): error C2065: 'score' : undeclared identifier

This site uses cookies for analytics, personalized content and ads. By continuing to browse this site, you agree to this use. Learn more

Microsoft (R) C/C++ Optimizing Compiler Version 19.11.25415 for x86. Copyright (C). error C2065: '__this': undeclared identifier. C:Program.

What are undeclared identifier errors? What are common causes and how do I fix them? Example error texts: For the Visual Studio compiler: error C2065: 'printf.

Error C2065: 'clrscr' : undeclared identifier MS Visual C++ / MFC Forum. (asit< 200) { int a; cout<<"ntSelect the class a/b/c as 0/1/2: "; cin>>a;.

c++ – error C2065: 'cout' : undeclared identifier – Stack. – I am working on the 'driver' part of my programing assignment and i keep getting this absurd error: error C2065: 'cout' : undeclared identifier I have even tried.

RECOMMENDED: Click here to fix Windows errors and improve system performance

About the Author

Alden

View Posts →