All-recursive Error 1 Freeswitch

RECOMMENDED: If you have Windows errors then we strongly recommend that you download and run this (Windows) Repair Tool.

struct streampos’ used where a `__off64_t’ was expected make[3]: *** [formula.lo] Error 1 make[3]: Leaving directory `/home/vxpmrz3/lyx-1.1.5fix2/src/mathed’ make[2]: *** [all-recursive] Error 1 make[2]: Leaving directory.

Description. Hi I am trying to install freeswitch on my Ubuntu 11.10 on pc and I get the following compilation error when I try to compile it o mod_xml_rpc.o >/dev/null 2>&1 Creating mod_xml_rpc.la. make[1]: *** [all-recursive] Error 1 make: *** [all] Error 2 [email protected]

PFSense Solutions – blogspot.com – PFSense Solutions provides technical information about PFsense setup and troubleshooting. Writers have hands on experience on PFsense. shining stars [email protected]

ld returned 1 exit status make[3]: *** [snort] Error 1 make[3]: Leaving directory `/usr/local/src/snort_src/snort-2.9.5.3/src’ make[2]: *** [all-recursive] Error 1 make[2]: Leaving directory `/usr/local/src/snort_src/snort-2.9.5.3/src’ make[1]: ***.

All endpoint modules expose an allowed_methods function with varying arities, determined. /vmboxes/{VMBOX_ID} would call cb_vmboxes:allowed_methods/ 1 , etc. to update XML files on all FreeSWITCH servers and reloading mod_kazoo, of kz_json , the raw representation of JSON was being used and error on it.

I did the function to create all the traces and it works only when I have. http://www.google.com/webhp?hl=en#hl=ensource=hpq=http+error+405aq=faqi=g6oq=fp.

У меня без конца возникает одна и та же ошибка при инсталляции Freeswitch. directory `/usr/src/freeswitch/src/mod' make[2]: *** [all-recursive] Error 1 make[2]: Leaving directory `/usr/src/freeswitch/src' make[1].

The FreeSWITCH 1.6.8 release is here! With the release of FreeSWITCH 1.6.8 we see some major improvements in the.deb based packaging. Included in this release is a fix for the freeswitch-all package. Prior to this fix, if certain.

mod_flite compile error. Hi iam having bit old Centos on hosted Platform 2.6.18-348.1.1.el5PAE #1 SMP Tue Jan 22 17:06:35 EST 2013 i686 i686 i386 GNU/Linux iam trying to install make[6]: Leaving directory `/usr/src/freeswitch/src/mod/asr_tts/mod_flite'. make[3]: *** [all-recursive] Error 1.

Unexpected Top-level Error Java.lang.assertionerror Runtime Error 11 Division By Zero Cyber Admin Control Simple Methods to Your Runtime Error 11 Division By Cero Cyber

Makefile:478: recipe for target 'all-recursive' failed. – Pastebin.com – make[1]: Leaving directory '/usr/src/freeswitch'. Makefile:970: recipe for target 'all' failed. ERROR: FreeSWITCH Build Failure. RAW Paste Data.

Jul 26, 2016. Enter mirror number (1-9) or URL to add (or r/f/e/done) [f]:, Select a mirror close to you and press Enter. all access not explictly allowed http_access deny all ## Squark URL rewriter #Prevent. #Recursive DNS configuration server: interface: 10.2.0.2. Start Freeswitch and configure to start at boot.

We designed and fabricated an integrated 1 × 4 wavelength selective switch using a silica planar lightwave circuit. Signal switching experiments show the switch to be error-free and have low power penalty. View All Authors. spacing, signal switching, error-free switch, bit error rate performance, bandwidth 100 GHz.

1 вариант загрузки : запустить freeswitch с -nc параметрами, запустить. that waits for the process to drop all resources that could be. make: *** [modules] Error 2. Dialplan: Processing recursive conditions level:1.

Stop. make[7]: *** [all-recursive] Error 1 Making all in packages make[6]: *** [all-recursive] Error 1 make[5]: *** [all] Error 2 make[4]: *** [/usr/src/freeswitch-1.2.5.3/libs/sofia-sip/libsofia-sip-ua/libsofia-sip-ua.la] Error 2 make[3]: ***.

Mapinfo Error Unable To Load Clr Resolving "Initialization error: unable to load the CLR (-2146232062)" in MapInfo Professional When try to install MapInfo Pro you may

RECOMMENDED: Click here to fix Windows errors and improve system performance

About the Author

Alden

View Posts →